Target
Calcitonin gene-related peptide type 1 receptor
Ligand
BDBM50329172
Substrate
Meas. Tech.
ChEMBL_674593 (CHEMBL1273692)
Ki
0.1±n/a nM
Citation
 Wood, MRSchirripa, KMKim, JJBednar, RAFay, JFBruno, JGMoore, ELMosser, SDRoller, SSalvatore, CAVacca, JPSelnick, HG Novel CGRP receptor antagonists from central amide replacements causing a reversal of preferred chirality. Bioorg Med Chem Lett 20:6827-30 (2010)  
Target
Name:
Calcitonin gene-related peptide type 1 receptor
Synonyms:
Adrenomedullin receptor AM1; CALCRL/RAMP2 CALRL_HUMAN CGRP type 1 receptor mRNA Calcitonin gene-related peptide (CGRP) receptor Calcitonin receptor-like receptor Human CL receptor
Type:
Enzyme Catalytic Domain
Mol. Mass.:
52980.45
Organism:
Homo sapiens (Human)
Description:
Q16602
Residue:
461
  
Inhibitor
Name:
BDBM50329172
Synonyms:
CHEMBL1270291 | N-(((S)-2'-oxo-1',2',6,8-tetrahydrospiro[cyclopenta[g]quinoline-7,3'-pyrrolo[2,3-b]pyridine]-3-yl)methyl)-N-((R)-1-phenylethyl)pivalamide
Type:
Small organic molecule
Emp. Form.:
C32H32N4O2
Mol. Mass.:
504.6221
SMILES:
C[C@@H](N(Cc1cnc2cc3C[C@]4(Cc3cc2c1)C(=O)Nc1ncccc41)C(=O)C(C)(C)C)c1ccccc1
: