Target
Calcitonin gene-related peptide type 1 receptor
Ligand
BDBM50329176
Substrate
Meas. Tech.
ChEMBL_674593 (CHEMBL1273692)
Ki
0.15±n/a nM
Citation
 Wood, MRSchirripa, KMKim, JJBednar, RAFay, JFBruno, JGMoore, ELMosser, SDRoller, SSalvatore, CAVacca, JPSelnick, HG Novel CGRP receptor antagonists from central amide replacements causing a reversal of preferred chirality. Bioorg Med Chem Lett 20:6827-30 (2010)  
Target
Name:
Calcitonin gene-related peptide type 1 receptor
Synonyms:
Adrenomedullin receptor AM1; CALCRL/RAMP2 CALRL_HUMAN CGRP type 1 receptor mRNA Calcitonin gene-related peptide (CGRP) receptor Calcitonin receptor-like receptor Human CL receptor
Type:
Enzyme Catalytic Domain
Mol. Mass.:
52980.45
Organism:
Homo sapiens (Human)
Description:
Q16602
Residue:
461
  
Inhibitor
Name:
BDBM50329176
Synonyms:
CHEMBL1269646 | N-(((R)-2,3-dihydro-1H-inden-1-yl)methyl)-N-(((S)-2'-oxo-1',2',6,8-tetrahydrospiro[cyclopenta[b][1,8]naphthyridine-7,3'-pyrrolo[2,3-b]pyridine]-3-yl)methyl)pivalamide
Type:
Small organic molecule
Emp. Form.:
C33H33N5O2
Mol. Mass.:
531.6474
SMILES:
CC(C)(C)C(=O)N(C[C@@H]1CCc2ccccc12)Cc1cnc2nc3C[C@]4(Cc3cc2c1)C(=O)Nc1ncccc41
: