Target
Gamma-aminobutyric acid receptor subunit alpha-1/beta-3/gamma-2
Ligand
BDBM50329662
Substrate
Meas. Tech.
ChEMBL_675478 (CHEMBL1273615)
Ki
17±n/a nM
Citation
 Yin, WMajumder, SClayton, TPetrou, SVanLinn, MLNamjoshi, OAMa, CCromer, BARoth, BLPlatt, DMCook, JM Design, synthesis, and subtype selectivity of 3,6-disubstitutedß-carbolines at Bz/GABA(A)ergic receptors. SAR and studies directed toward agents for treatment of alcohol abuse. Bioorg Med Chem 18:7548-64 (2010)  
Target
Name:
Gamma-aminobutyric acid receptor subunit alpha-1/beta-3/gamma-2
Synonyms:
GABA receptor alpha-1/beta-3/gamma-2 subunit GABAA alpha1beta3gamma2
Type:
Protein
Mol. Mass.:
Description:
Components:
This complex has 3 components.
Component 1
Name:
Gamma-aminobutyric acid receptor subunit alpha-1
Synonyms:
Benzodiazepine central GABA A Benzodiazepine liver GABA(A) receptor subunit alpha-1 GABA-A receptor GBRA1_HUMAN TBPS | agonist GABA site
Type:
Protein
Mol. Mass.:
51817.35
Organism:
Homo sapiens (Human)
Description:
P14867
Residue:
456
  
Component 2
Name:
Gamma-aminobutyric acid receptor subunit beta-3
Synonyms:
GABA A receptor alpha-4/beta-3/gamma-2 GABA-A receptor GBRB3_HUMAN | agonist GABA site
Type:
PROTEIN
Mol. Mass.:
54130.51
Organism:
Homo sapiens (Human)
Description:
ChEMBL_448071
Residue:
473
  
Component 3
Name:
Gamma-aminobutyric acid receptor subunit gamma-2
Synonyms:
GABA(A) receptor subunit gamma-2 GBRG2_HUMAN
Type:
PROTEIN
Mol. Mass.:
54172.74
Organism:
Homo sapiens (Human)
Description:
EBI_217
Residue:
467
  
Inhibitor
Name:
BDBM50329662
Synonyms:
3-(3,3-dimethylbut-1-ynyl)-6-(5,5-dimethylhex-1-en-2-yl)-9H-fluorene | CHEMBL1270143
Type:
Small organic molecule
Emp. Form.:
C19H17F3N2O2Si
Mol. Mass.:
390.4312
SMILES:
C[Si](C)(C)C#Cc1ccc2[nH]c3cnc(cc3c2c1)C(=O)OCC(F)(F)F
: