Target
Carbonic anhydrase 7
Ligand
BDBM50329770
Substrate
Meas. Tech.
ChEMBL_674744 (CHEMBL1273997)
Kd
830±n/a nM
Citation
 Sudžius, JBaranauskiene, LGolovenko, DMatuliene, JMichailoviene, VTorresan, JJachno, JSukackaite, RManakova, EGražulis, STumkevičius, SMatulis, D 4-[N-(substituted 4-pyrimidinyl)amino]benzenesulfonamides as inhibitors of carbonic anhydrase isozymes I, II, VII, and XIII. Bioorg Med Chem 18:7413-21 (2010)  
Target
Name:
Carbonic anhydrase 7
Synonyms:
CA-VII CAH7_HUMAN Carbonic anhydrase Carbonic anhydrase VII (CA VII)
Type:
Enzyme
Mol. Mass.:
29664.11
Organism:
Homo sapiens (Human)
Description:
Human cloned isozyme.
Residue:
264
  
Inhibitor
Name:
BDBM50329770
Synonyms:
4-{[(6-methoxy-5-nitropyrimidin-4-yl)amino]methyl}benzenesulfonamide CHEMBL1233725
Type:
Small organic molecule
Emp. Form.:
C12H13N5O5S
Mol. Mass.:
339.327
SMILES:
COc1ncnc(NCc2ccc(cc2)S(N)(=O)=O)c1[N+]([O-])=O
: