Target
Endothelin-1 receptor
Ligand
BDBM50329850
Substrate
Meas. Tech.
ChEMBL_675728 (CHEMBL1272362)
IC50
24.8±n/a nM
Citation
 Patel, HJOlgun, NLengyel, IReznik, SStephani, RA Synthesis and pharmacological activity of 1,3,6-trisubstituted-4-oxo-1,4-dihydroquinoline-2-carboxylic acids as selective ET(A) antagonists. Bioorg Med Chem Lett 20:6840-4 (2010)  
Target
Name:
Endothelin-1 receptor
Synonyms:
EDNRA ET-A ETA-R Endothelin receptor type A hET-AR
Type:
Enzyme Catalytic Domain
Mol. Mass.:
48736.88
Organism:
Homo sapiens (Human)
Description:
P25101
Residue:
427
  
Inhibitor
Name:
BDBM50329850
Synonyms:
(R)-3-Amino-4-[(S)-2-((R)-1-{(S)-1-[(R)-1-(1H-indol-3-ylmethyl)-2-oxo-ethylcarbamoyl]-3-methyl-but-3-enylcarbamoyl}-2-methyl-propylcarbamoyl)-pyrrolidin-1-yl]-4-oxo-butyric acid CHEMBL1269102 [(5R,8R,11S,14R,16aR)-8-(1H-Indol-3-ylmethyl)-11-isobutyl-14-isopropyl-4,7,10,13,16-pentaoxo-hexadecahydro-3a,6,9,12,15-pentaaza-cyclopentacyclopentadecen-5-yl]-acetic acid [8-(1H-Indol-3-ylmethyl)-11-isobutyl-14-isopropyl-4,7,10,13,16-pentaoxo-hexadecahydro-3a,6,9,12,15-pentaaza-cyclopentacyclopentadecen-5-yl]-acetic acid
Type:
Small organic molecule
Emp. Form.:
C31H42N6O7
Mol. Mass.:
610.7012
SMILES:
CC(C)C[C@@H]1NC(=O)[C@H](NC(=O)[C@@H]2CCCN2C(=O)[C@H](CC(O)=O)NC(=O)[C@@H](Cc2c[nH]c3ccccc23)NC1=O)C(C)C
: