Target
Nitric oxide synthase, endothelial
Ligand
BDBM50330054
Substrate
Meas. Tech.
ChEMBL_676073 (CHEMBL1273067)
IC50
100000±n/a nM
Citation
 Maccallini, CPatruno, ALannutti, FAmmazzalorso, ADe Filippis, BFantacuzzi, MFranceschelli, SGiampietro, LMasella, SFelaco, MRe, NAmoroso, R N-Substituted acetamidines and 2-methylimidazole derivatives as selective inhibitors of neuronal nitric oxide synthase. Bioorg Med Chem Lett 20:6495-9 (2010)  
Target
Name:
Nitric oxide synthase, endothelial
Synonyms:
Constitutive NOS Endothelial nitric oxide synthase NOS type III NOS3_BOVIN Nitric-oxide synthase, endothelial | cNOS
Type:
Enzyme
Mol. Mass.:
133292.26
Organism:
Bos taurus (bovine)
Description:
Recombinant eNOS overexpressed in E. coli was used in enzyme assays.
Residue:
1205
  
Inhibitor
Name:
BDBM50330054
Synonyms:
4-[(2-Methyl-1H-imidazol-1-yl)methyl]pyridine | CHEMBL1269156
Type:
Small organic molecule
Emp. Form.:
C10H11N3
Mol. Mass.:
173.2144
SMILES:
Cc1nccn1Cc1ccncc1
: