Target
Nitric oxide synthase, endothelial
Ligand
BDBM50330059
Substrate
Meas. Tech.
ChEMBL_676073 (CHEMBL1273067)
IC50
100000±n/a nM
Citation
 Maccallini, CPatruno, ALannutti, FAmmazzalorso, ADe Filippis, BFantacuzzi, MFranceschelli, SGiampietro, LMasella, SFelaco, MRe, NAmoroso, R N-Substituted acetamidines and 2-methylimidazole derivatives as selective inhibitors of neuronal nitric oxide synthase. Bioorg Med Chem Lett 20:6495-9 (2010)  
Target
Name:
Nitric oxide synthase, endothelial
Synonyms:
Constitutive NOS Endothelial nitric oxide synthase NOS type III NOS3_BOVIN Nitric-oxide synthase, endothelial | cNOS
Type:
Enzyme
Mol. Mass.:
133292.26
Organism:
Bos taurus (bovine)
Description:
Recombinant eNOS overexpressed in E. coli was used in enzyme assays.
Residue:
1205
  
Inhibitor
Name:
BDBM50330059
Synonyms:
(+/-)-1-[(2-Methyl-1-phenylpropyl)amino]ethaniminium bromide | CHEMBL1269103
Type:
Small organic molecule
Emp. Form.:
C12H18N2
Mol. Mass.:
190.2847
SMILES:
CC(C)C(N=C(C)N)c1ccccc1
: