Target
Nitric oxide synthase, brain
Ligand
BDBM50226527
Substrate
Meas. Tech.
ChEMBL_676072 (CHEMBL1273066)
IC50
7300±n/a nM
Citation
 Maccallini, CPatruno, ALannutti, FAmmazzalorso, ADe Filippis, BFantacuzzi, MFranceschelli, SGiampietro, LMasella, SFelaco, MRe, NAmoroso, R N-Substituted acetamidines and 2-methylimidazole derivatives as selective inhibitors of neuronal nitric oxide synthase. Bioorg Med Chem Lett 20:6495-9 (2010)  
Target
Name:
Nitric oxide synthase, brain
Synonyms:
Bnos NC-NOS NOS type I nNOS Neuronal nitric oxide synthase Nitric Oxide Synthase, brain Nitric oxide synthase, brain (nNOS) Nitric-oxide synthase, brain (nNOS) Nos1 | Peptidyl-cysteine S-nitrosylase NOS1
Type:
Enzyme
Mol. Mass.:
160570.98
Organism:
Rattus norvegicus (rat)
Description:
Recombinant nNOS overexpressed in E. coli was used in enzyme assays.
Residue:
1429
  
Inhibitor
Name:
BDBM50226527
Synonyms:
CHEMBL107251 N-(3-(aminomethyl)benzyl)acetimidamide N-(3-aminomethyl)benzylacetimidamide N-[[3-(aminomethyl)phenyl]methyl]-ethanimidamide | [N-(3-aminomethyl)benzylactamidine]
Type:
Small organic molecule
Emp. Form.:
C10H15N3
Mol. Mass.:
177.2462
SMILES:
CC(N)=NCc1cccc(CN)c1
: