Target
Bcl-2-related protein A1
Ligand
BDBM50313335
Substrate
Meas. Tech.
ChEMBL_676082 (CHEMBL1273076)
IC50
800±n/a nM
Citation
 Cashman, JRMacDonald, MGhirmai, SOkolotowicz, KJSergienko, EBrown, BGarcia, XZhai, DDahl, RReed, JC Inhibition of Bfl-1 with N-aryl maleimides. Bioorg Med Chem Lett 20:6560-4 (2010)  
Target
Name:
Bcl-2-related protein A1
Synonyms:
B2LA1_HUMAN BCL2L5 Bcl-2-like protein 5 HBPA1 Protein BFL-1 | Protein GRS
Type:
Apoptosis regulator protein
Mol. Mass.:
20130.01
Organism:
Homo sapiens (Human)
Description:
Residue:
175
  
Inhibitor
Name:
BDBM50313335
Synonyms:
6-(cyclohexylamino)-N-(4-sulfamoylphenyl)pyrimidine-4-carboxamide US9150519, 1-17
Type:
Small organic molecule
Emp. Form.:
C17H21N5O3S
Mol. Mass.:
375.445
SMILES:
NS(=O)(=O)c1ccc(NC(=O)c2cc(NC3CCCCC3)ncn2)cc1
: