Target
Bcl-2-related protein A1
Ligand
BDBM39143
Substrate
Meas. Tech.
ChEMBL_676083 (CHEMBL1273077)
IC50
1000±n/a nM
Citation
 Cashman, JRMacDonald, MGhirmai, SOkolotowicz, KJSergienko, EBrown, BGarcia, XZhai, DDahl, RReed, JC Inhibition of Bfl-1 with N-aryl maleimides. Bioorg Med Chem Lett 20:6560-4 (2010)  
Target
Name:
Bcl-2-related protein A1
Synonyms:
B2LA1_HUMAN BCL2L5 Bcl-2-like protein 5 HBPA1 Protein BFL-1 | Protein GRS
Type:
Apoptosis regulator protein
Mol. Mass.:
20130.01
Organism:
Homo sapiens (Human)
Description:
Residue:
175
  
Inhibitor
Name:
BDBM39143
Synonyms:
3-chloranyl-1-(2-chlorophenyl)-4-(4-methylpiperazin-1-yl)pyrrole-2,5-dione 3-chloro-1-(2-chlorophenyl)-4-(4-methyl-1-piperazinyl)pyrrole-2,5-dione 3-chloro-1-(2-chlorophenyl)-4-(4-methylpiperazino)-3-pyrroline-2,5-quinone MLS-0090833.0001 | cid_16654640
Type:
Small organic molecule
Emp. Form.:
C15H15Cl2N3O2
Mol. Mass.:
340.205
SMILES:
CN1CCN(CC1)C1=C(Cl)C(=O)N(C1=O)c1ccccc1Cl
: