Target
Bcl-2-related protein A1
Ligand
BDBM50330257
Substrate
Meas. Tech.
ChEMBL_676277 (CHEMBL1273518)
IC50
690±n/a nM
Citation
 Wei, JKitada, SStebbins, JLPlaczek, WZhai, DWu, BRega, MFZhang, ZCellitti, JYang, LDahl, RReed, JCPellecchia, M Synthesis and biological evaluation of Apogossypolone derivatives as pan-active inhibitors of antiapoptotic B-cell lymphoma/leukemia-2 (Bcl-2) family proteins. J Med Chem 53:8000-11 (2010)  
Target
Name:
Bcl-2-related protein A1
Synonyms:
B2LA1_HUMAN BCL2L5 Bcl-2-like protein 5 HBPA1 Protein BFL-1 | Protein GRS
Type:
Apoptosis regulator protein
Mol. Mass.:
20130.01
Organism:
Homo sapiens (Human)
Description:
Residue:
175
  
Inhibitor
Name:
BDBM50330257
Synonyms:
6,6',7,7'-Tetrahydroxy-3,3'-dimethyl-5,5'-bis(2-phenylacetyl)-2,2'-binaphthyl-1,1',4,4'-tetraone | CHEMBL1269072
Type:
Small organic molecule
Emp. Form.:
C38H26O10
Mol. Mass.:
642.607
SMILES:
CC1=C(C(=O)c2cc(O)c(O)c(C(=O)Cc3ccccc3)c2C1=O)C1=C(C)C(=O)c2c(cc(O)c(O)c2C(=O)Cc2ccccc2)C1=O
: