Target
Serine/threonine-protein kinase Chk1
Ligand
BDBM50330776
Substrate
Meas. Tech.
ChEMBL_685392 (CHEMBL1287592)
IC50
2.8±n/a nM
Citation
 Sako, YIchikawa, SOsada, AMatsuda, A Synthesis and evaluation of 5-substituted 9-hydroxypyrrolo[3,4-c]carbazole-1,3(2H,6H)-diones as check point 1 kinase inhibitors. Bioorg Med Chem 18:7878-89 (2010)  
Target
Name:
Serine/threonine-protein kinase Chk1
Synonyms:
CHEK1 CHK1 checkpoint homolog Checkpoint kinase-1 (CHK1)
Type:
Enzyme Catalytic Domain
Mol. Mass.:
54443.02
Organism:
Homo sapiens (Human)
Description:
gi_166295192
Residue:
476
  
Inhibitor
Name:
BDBM50330776
Synonyms:
5-{3-[2-(Guanidino)ethylcarbamoyl]benzylaminocarboyl}-9-hydroxy-1,3-dihydropyrrolo[3,4-c]carbazole-1,3-(2H,6H)-dione hydrochloride | CHEMBL1276955
Type:
Small organic molecule
Emp. Form.:
C26H23N7O5
Mol. Mass.:
513.5047
SMILES:
NC(N)=NCCNC(=O)c1cccc(CNC(=O)c2cc3C(=O)NC(=O)c3c3c4cc(O)ccc4[nH]c23)c1
: