Target
Vascular endothelial growth factor receptor 2
Ligand
BDBM50331090
Substrate
Meas. Tech.
ChEMBL_686224 (CHEMBL1292980)
IC50
1.6±n/a nM
Citation
 Lee, KJeong, KWLee, YSong, JYKim, MSLee, GSKim, Y Pharmacophore modeling and virtual screening studies for new VEGFR-2 kinase inhibitors. Eur J Med Chem 45:5420-7 (2010)  
Target
Name:
Vascular endothelial growth factor receptor 2
Synonyms:
CD_antigen=CD309 Fetal liver kinase 1 (FLK-1) KDR Protein-tyrosine kinase receptor Flk-1 VEGFR-2 VEGFR2 Vascular Endothelial Growth Factor Receptor Kinase 2 Vascular endothelial growth factor receptor 2 (KDR) Vascular endothelial growth factor receptor 2 (VEGFR2) Vascular endothelial growth factor receptor-2 (VEGFR-2)
Type:
Receptor Tyrosine Kinase
Mol. Mass.:
151510.97
Organism:
Homo sapiens (Human)
Description:
P35968
Residue:
1356
  
Inhibitor
Name:
BDBM50331090
Synonyms:
4-((5H-[1,2,4]triazino[5,6-b]indol-3-ylthio)methyl)-N-(2-methoxyphenyl)benzamide | CHEMBL1290030
Type:
Small organic molecule
Emp. Form.:
C24H19N5O2S
Mol. Mass.:
441.505
SMILES:
COc1ccccc1NC(=O)c1ccc(CSc2nnc3c(n2)[nH]c2ccccc32)cc1
: