Target
Insulin-like growth factor 1 receptor
Ligand
BDBM50331618
Substrate
Meas. Tech.
ChEMBL_687448 (CHEMBL1292124)
Ki
370±n/a nM
Citation
 Krug, MErlenkamp, GSippl, WSchächtele, CTotzke, FHilgeroth, A Discovery and selectivity-profiling of 4-benzylamino 1-aza-9-oxafluorene derivatives as lead structures for IGF-1R inhibitors. Bioorg Med Chem Lett 20:6915-9 (2010)  
Target
Name:
Insulin-like growth factor 1 receptor
Synonyms:
CD_antigen=CD221 IGF1R Insulin-like growth factor 1 receptor (IGF1R) Insulin-like growth factor 1 receptor alpha chain Insulin-like growth factor I receptor | Insulin-like growth factor receptor (IGFR)
Type:
Protein
Mol. Mass.:
154776.79
Organism:
Homo sapiens (Human)
Description:
P08069
Residue:
1367
  
Inhibitor
Name:
BDBM50331618
Synonyms:
CHEMBL1289976 | N-benzylbenzofuro[2,3-b]pyridin-4-amine
Type:
Small organic molecule
Emp. Form.:
C18H14N2O
Mol. Mass.:
274.3166
SMILES:
C(Nc1ccnc2oc3ccccc3c12)c1ccccc1
: