Target
Tyrosine-protein kinase JAK2
Ligand
BDBM50331816
Substrate
Meas. Tech.
ChEMBL_686866 (CHEMBL1291235)
IC50
8350±n/a nM
Citation
 Siu, TKozina, ESJung, JRosenstein, CMathur, AAltman, MDChan, GXu, LBachman, EMo, JRBouthillette, MRush, TDinsmore, CJMarshall, CGYoung, JR The discovery of tricyclic pyridone JAK2 inhibitors. Part 1: hit to lead. Bioorg Med Chem Lett 20:7421-5 (2010)  
Target
Name:
Tyrosine-protein kinase JAK2
Synonyms:
JAK-2 JAK2_HUMAN Janus kinase 2 (JAK2) | Janus kinase 2 (a protein tyrosine kinase)
Type:
Protein
Mol. Mass.:
130684.68
Organism:
Homo sapiens (Human)
Description:
O60674
Residue:
1132
  
Inhibitor
Name:
BDBM50331816
Synonyms:
CHEMBL1290308 | N-(2-(dimethylamino)ethyl)-2-(3,3-dimethylbutan-2-ylamino)-5-oxo-5,6-dihydro-1,6-naphthyridine-3-carboxamide
Type:
Small organic molecule
Emp. Form.:
C19H29N5O2
Mol. Mass.:
359.4659
SMILES:
CC(Nc1nc2cc[nH]c(=O)c2cc1C(=O)NCCN(C)C)C(C)(C)C
: