Target
Prostaglandin G/H synthase 2
Ligand
BDBM50331888
Substrate
Meas. Tech.
ChEMBL_687200 (CHEMBL1291825)
IC50
8400±n/a nM
Citation
 Lai, YMa, LHuang, WYu, XZhang, YJi, HTian, J Synthesis and biological evaluation of 3-[4-(amino/methylsulfonyl)phenyl]methylene-indolin-2-one derivatives as novel COX-1/2 and 5-LOX inhibitors. Bioorg Med Chem Lett 20:7349-53 (2010)  
Target
Name:
Prostaglandin G/H synthase 2
Synonyms:
COX-2 PGH synthase 2 PGHS-2 PTGS2 Prostaglandin-endoperoxide synthase 2
Type:
PROTEIN
Mol. Mass.:
69015.55
Organism:
Oryctolagus cuniculus
Description:
ChEMBL_687200
Residue:
604
  
Inhibitor
Name:
BDBM50331888
Synonyms:
5-Chloro-2-oxo-3-(thiophene-2-carbonyl)-2,3-dihydro-indole-1-carboxylic acid amide CHEMBL1097558 | Tenidap
Type:
Small organic molecule
Emp. Form.:
C14H9ClN2O3S
Mol. Mass.:
320.751
SMILES:
NC(=O)n1c(O)c(C(=O)c2cccs2)c2cc(Cl)ccc12
: