Target
Metabotropic glutamate receptor 5
Ligand
BDBM50156071
Substrate
Meas. Tech.
ChEMBL_687415 (CHEMBL1292091)
Ki
250±n/a nM
Citation
 Xiong, HBrugel, TABalestra, MBrown, DGBrush, KAHightower, CHinkley, LHoesch, VKang, JKoether, GMMcCauley, JPMcLaren, FMPanko, LMSimpson, TRSmith, RWWoods, JMBrockel, BChhajlani, VGadient, RASpear, NSygowski, LAZhang, MArora, JBreysse, NWilson, JMIsaac, MSlassi, AKing, MM 4-aryl piperazine and piperidine amides as novel mGluR5 positive allosteric modulators. Bioorg Med Chem Lett 20:7381-4 (2010)  
Target
Name:
Metabotropic glutamate receptor 5
Synonyms:
GPRC1E GRM5_HUMAN metabotropic glutamate 5 | metabotropic glutamate 5a
Type:
Enzyme
Mol. Mass.:
132484.72
Organism:
Homo sapiens (Human)
Description:
Residue:
1212
  
Inhibitor
Name:
BDBM50156071
Synonyms:
3-Cyano-N-(2,5-diphenyl-2H-pyrazol-3-yl)-benzamide CHEMBL190270
Type:
Small organic molecule
Emp. Form.:
C23H16N4O
Mol. Mass.:
364.3993
SMILES:
O=C(Nc1cc(nn1-c1ccccc1)-c1ccccc1)c1cccc(c1)C#N
: