Target
Sodium channel protein type 9 subunit alpha
Ligand
BDBM50332656
Substrate
Meas. Tech.
ChEMBL_697999 (CHEMBL1633059)
IC50
10±n/a nM
Citation
 Tyagarajan, SChakravarty, PKZhou, BTaylor, BEid, RFisher, MHParsons, WHWyvratt, MJLyons, KAKlatt, TLi, XKumar, SWilliams, BFelix, JPriest, BTBrochu, RMWarren, VSmith, MGarcia, MKaczorowski, GJMartin, WJAbbadie, CMcGowan, EJochnowitz, NWeber, ADuffy, JL Discovery of a novel class of biphenyl pyrazole sodium channel blockers for treatment of neuropathic pain. Bioorg Med Chem Lett 20:7479-82 (2010)  
Target
Name:
Sodium channel protein type 9 subunit alpha
Synonyms:
NENA Peripheral sodium channel 1 SCN9A_HUMAN Voltage-gated sodium channel subunit Nav1.7 hNE-Na
Type:
Protein
Mol. Mass.:
226375.97
Organism:
Homo sapiens (Human)
Description:
Q15858
Residue:
1988
  
Inhibitor
Name:
BDBM50332656
Synonyms:
CHEMBL1631089 | ethyl 3-carbamoyl-1-(2'-(trifluoromethoxy)biphenyl-3-yl)-1H-pyrazole-5-carboxylate
Type:
Small organic molecule
Emp. Form.:
C20H16F3N3O4
Mol. Mass.:
419.3539
SMILES:
CCOC(=O)c1cc(nn1-c1cccc(c1)-c1ccccc1OC(F)(F)F)C(N)=O
: