Target
Oxytocin receptor
Ligand
BDBM50332727
Substrate
Meas. Tech.
ChEMBL_697994 (CHEMBL1633054)
Ki
1404±n/a nM
Citation
 Muttenthaler, MAndersson, Ade Araujo, ADDekan, ZLewis, RJAlewood, PF Modulating oxytocin activity and plasma stability by disulfide bond engineering. J Med Chem 53:8585-96 (2010)  
Target
Name:
Oxytocin receptor
Synonyms:
OT-R OXYR_HUMAN | Oxytocin
Type:
Enzyme Catalytic Domain
Mol. Mass.:
42793.26
Organism:
Homo sapiens (Human)
Description:
Oxytocin OXTR HEK293::B2R9L7
Residue:
389
  
Inhibitor
Name:
BDBM50332727
Synonyms:
CHEMBL1630532 | cyclo(CYIQNCPLG)
Type:
Small organic molecule
Emp. Form.:
C42H61N11O12S2
Mol. Mass.:
976.13
SMILES:
CC[C@H](C)[C@@H]1NC(=O)[C@H](Cc2ccc(O)cc2)NC(=O)[C@@H]2CSSC[C@H](NC(=O)[C@@H](NC(=O)[C@H](CCC(N)=O)NC1=O)C(N)=O)C(=O)N1CCC[C@H]1C(=O)N[C@@H](CC(C)C)C(=O)NCC(=O)N2
: