Target
Oxytocin receptor
Ligand
BDBM50332730
Substrate
Meas. Tech.
ChEMBL_697993 (CHEMBL1633053)
EC50
>100000±n/a nM
Citation
 Muttenthaler, MAndersson, Ade Araujo, ADDekan, ZLewis, RJAlewood, PF Modulating oxytocin activity and plasma stability by disulfide bond engineering. J Med Chem 53:8585-96 (2010)  
Target
Name:
Oxytocin receptor
Synonyms:
OT-R OXYR_HUMAN | Oxytocin
Type:
Enzyme Catalytic Domain
Mol. Mass.:
42793.26
Organism:
Homo sapiens (Human)
Description:
Oxytocin OXTR HEK293::B2R9L7
Residue:
389
  
Inhibitor
Name:
BDBM50332730
Synonyms:
(R)-N-((R)-1-(2-amino-2-oxoethylamino)-3-methylbutyl)-1-((4S,7R,10R,13R,16R,19S)-19-amino-7-(2-amino-2-oxoethyl)-10-(3-amino-3-oxopropyl)-13-sec-butyl-16-(4-hydroxybenzyl)-6,9,12,15,18-pentaoxo-1,2-dithia-5,8,11,14,17-pentaazacycloicosane-4-carbonyl)pyrrolidine-2-carboxamide | CHEMBL1630535
Type:
Small organic molecule
Emp. Form.:
C42H66N12O11S2
Mol. Mass.:
979.177
SMILES:
CC[C@@H](C)[C@H]1NC(=O)[C@@H](Cc2ccc(O)cc2)NC(=O)[C@H](N)CSSC[C@@H](NC(=O)[C@@H](CC(N)=O)NC(=O)[C@@H](CCC(N)=O)NC1=O)C(=O)N1CCC[C@@H]1C(=O)N[C@H](CC(C)C)NCC(N)=O
: