Target
Metabotropic glutamate receptor 2
Ligand
BDBM50332970
Substrate
Meas. Tech.
ChEMBL_696229 (CHEMBL1639382)
IC50
13±n/a nM
Citation
 Woltering, TJWichmann, JGoetschi, EKnoflach, FBallard, TMHuwyler, JGatti, S Synthesis and characterization of 1,3-dihydro-benzo[b][1,4]diazepin-2-one derivatives: Part 4. In vivo active potent and selective non-competitive metabotropic glutamate receptor 2/3 antagonists. Bioorg Med Chem Lett 20:6969-74 (2010)  
Target
Name:
Metabotropic glutamate receptor 2
Synonyms:
GPRC1B GRM2_HUMAN Metabotropic glutamate receptor mGlu2 | metabotropic glutamate 2
Type:
Enzyme
Mol. Mass.:
95584.88
Organism:
Homo sapiens (Human)
Description:
Q14416
Residue:
872
  
Inhibitor
Name:
BDBM50332970
Synonyms:
7-methyl-4-(3-(2-methylpyridin-4-yl)phenyl)-8-(trifluoromethyl)-1H-benzo[b][1,4]diazepin-2(3H)-one | CHEMBL1631859
Type:
Small organic molecule
Emp. Form.:
C23H18F3N3O
Mol. Mass.:
409.4037
SMILES:
Cc1cc(ccn1)-c1cccc(c1)C1=Nc2cc(C)c(cc2NC(=O)C1)C(F)(F)F
: