Target
Tyrosine-protein kinase Lck
Ligand
BDBM50333372
Substrate
Meas. Tech.
ChEMBL_698627 (CHEMBL1647900)
IC50
370±n/a nM
Citation
 Fink, BENorris, DMastalerz, HChen, PGoyal, BZhao, YKim, SHVite, GDLee, FYZhang, HOppenheimer, STokarski, JSWong, TWGavai, AV Novel pyrrolo[2,1-f][1,2,4]triazin-4-amines: Dual inhibitors of EGFR and HER2 protein tyrosine kinases. Bioorg Med Chem Lett 21:781-5 (2011)  
Target
Name:
Tyrosine-protein kinase Lck
Synonyms:
2.7.10.2 LCK_HUMAN Leukocyte C-terminal Src kinase Lymphocyte-specific protein tyrosine kinase Protein YT16 Proto-oncogene tyrosine-protein kinase LCK T cell-specific protein-tyrosine kinase
Type:
Mol. Mass.:
57987.83
Organism:
Homo sapiens (Human)
Description:
P06239
Residue:
509
  
Inhibitor
Name:
BDBM50333372
Synonyms:
5-((4-aminopiperidin-1-yl)methyl)-N-(3-chloro-4-fluorophenyl)pyrrolo[1,2-f][1,2,4]triazin-4-amine | CHEMBL1645476
Type:
Small organic molecule
Emp. Form.:
C18H20ClFN6
Mol. Mass.:
374.843
SMILES:
NC1CCN(Cc2ccn3ncnc(Nc4ccc(F)c(Cl)c4)c23)CC1
: