Target
Epidermal growth factor receptor
Ligand
BDBM50333373
Substrate
Meas. Tech.
ChEMBL_698459 (CHEMBL1647391)
IC50
32±n/a nM
Citation
 Fink, BENorris, DMastalerz, HChen, PGoyal, BZhao, YKim, SHVite, GDLee, FYZhang, HOppenheimer, STokarski, JSWong, TWGavai, AV Novel pyrrolo[2,1-f][1,2,4]triazin-4-amines: Dual inhibitors of EGFR and HER2 protein tyrosine kinases. Bioorg Med Chem Lett 21:781-5 (2011)  
Target
Name:
Epidermal growth factor receptor
Synonyms:
EGF Receptor Substrate EGFR_HUMAN ERBB1 Epidermal Growth Factor Receptor erbB-1 Epidermal growth factor receptor (EGFR) HER1 Proto-oncogene c-ErbB-1 Tyrosine-Protein Kinase ErbB-1
Type:
Receptor Kinase Domain
Mol. Mass.:
134279.59
Organism:
Homo sapiens (Human)
Description:
P00533
Residue:
1210
  
Inhibitor
Name:
BDBM50333373
Synonyms:
CHEMBL1645462 | [4-[[1-(3-fluorophenyl)methyl]-1H-indazol-5-ylamino]-5-methyl-pyrrolo[2,1-f][1,2,4]triazin-6-yl]-carbamic acid
Type:
Small organic molecule
Emp. Form.:
C27H27FN8O3
Mol. Mass.:
530.5535
SMILES:
Cc1c(NC(=O)OC[C@@H]2COCCN2)cn2ncnc(Nc3ccc4n(Cc5cccc(F)c5)ncc4c3)c12
: