Target
Receptor tyrosine-protein kinase erbB-2
Ligand
BDBM50333373
Substrate
Meas. Tech.
ChEMBL_698460 (CHEMBL1647392)
IC50
23±n/a nM
Citation
 Fink, BENorris, DMastalerz, HChen, PGoyal, BZhao, YKim, SHVite, GDLee, FYZhang, HOppenheimer, STokarski, JSWong, TWGavai, AV Novel pyrrolo[2,1-f][1,2,4]triazin-4-amines: Dual inhibitors of EGFR and HER2 protein tyrosine kinases. Bioorg Med Chem Lett 21:781-5 (2011)  
Target
Name:
Receptor tyrosine-protein kinase erbB-2
Synonyms:
2.7.10.1 CD_antigen=CD340 ERBB2_HUMAN FASN/HER2 HER2 MLN19 NEU Proto-oncogene Neu Tyrosine kinase-type cell surface receptor HER2 | p185erbB2
Type:
Mol. Mass.:
137894.47
Organism:
Homo sapiens (Human)
Description:
P04626
Residue:
1255
  
Inhibitor
Name:
BDBM50333373
Synonyms:
CHEMBL1645462 | [4-[[1-(3-fluorophenyl)methyl]-1H-indazol-5-ylamino]-5-methyl-pyrrolo[2,1-f][1,2,4]triazin-6-yl]-carbamic acid
Type:
Small organic molecule
Emp. Form.:
C27H27FN8O3
Mol. Mass.:
530.5535
SMILES:
Cc1c(NC(=O)OC[C@@H]2COCCN2)cn2ncnc(Nc3ccc4n(Cc5cccc(F)c5)ncc4c3)c12
: