Target
Epidermal growth factor receptor
Ligand
BDBM50217191
Substrate
Meas. Tech.
ChEMBL_698459 (CHEMBL1647391)
IC50
35±n/a nM
Citation
 Fink, BENorris, DMastalerz, HChen, PGoyal, BZhao, YKim, SHVite, GDLee, FYZhang, HOppenheimer, STokarski, JSWong, TWGavai, AV Novel pyrrolo[2,1-f][1,2,4]triazin-4-amines: Dual inhibitors of EGFR and HER2 protein tyrosine kinases. Bioorg Med Chem Lett 21:781-5 (2011)  
Target
Name:
Epidermal growth factor receptor
Synonyms:
EGF Receptor Substrate EGFR_HUMAN ERBB1 Epidermal Growth Factor Receptor erbB-1 Epidermal growth factor receptor (EGFR) HER1 Proto-oncogene c-ErbB-1 Tyrosine-Protein Kinase ErbB-1
Type:
Receptor Kinase Domain
Mol. Mass.:
134279.59
Organism:
Homo sapiens (Human)
Description:
P00533
Residue:
1210
  
Inhibitor
Name:
BDBM50217191
Synonyms:
CHEMBL248108 | N-(1-(3-fluorobenzyl)-1H-indazol-5-yl)-5-((4-aminopiperidin-1-yl)methyl)pyrrolo[1,2-f][1,2,4]triazin-4-amine
Type:
Small organic molecule
Emp. Form.:
C26H27FN8
Mol. Mass.:
470.5446
SMILES:
NC1CCN(Cc2ccn3ncnc(Nc4ccc5n(Cc6cccc(F)c6)ncc5c4)c23)CC1
: