Target
Receptor tyrosine-protein kinase erbB-2
Ligand
BDBM50204134
Substrate
Meas. Tech.
ChEMBL_698460 (CHEMBL1647392)
IC50
55±n/a nM
Citation
 Fink, BENorris, DMastalerz, HChen, PGoyal, BZhao, YKim, SHVite, GDLee, FYZhang, HOppenheimer, STokarski, JSWong, TWGavai, AV Novel pyrrolo[2,1-f][1,2,4]triazin-4-amines: Dual inhibitors of EGFR and HER2 protein tyrosine kinases. Bioorg Med Chem Lett 21:781-5 (2011)  
Target
Name:
Receptor tyrosine-protein kinase erbB-2
Synonyms:
2.7.10.1 CD_antigen=CD340 ERBB2_HUMAN FASN/HER2 HER2 MLN19 NEU Proto-oncogene Neu Tyrosine kinase-type cell surface receptor HER2 | p185erbB2
Type:
Mol. Mass.:
137894.47
Organism:
Homo sapiens (Human)
Description:
P04626
Residue:
1255
  
Inhibitor
Name:
BDBM50204134
Synonyms:
(S)-N-(1-(3-fluorobenzyl)-1H-indazol-5-yl)-5-((morpholin-2-ylmethoxy)methyl)pyrrolo[1,2-f][1,2,4]triazin-4-amine | CHEMBL246284
Type:
Small organic molecule
Emp. Form.:
C26H26FN7O2
Mol. Mass.:
487.5287
SMILES:
Fc1cccc(Cn2ncc3cc(Nc4ncnn5ccc(COC[C@@H]6CNCCO6)c45)ccc23)c1
: