Target
Epidermal growth factor receptor
Ligand
BDBM50333374
Substrate
Meas. Tech.
ChEMBL_698459 (CHEMBL1647391)
IC50
9±n/a nM
Citation
 Fink, BENorris, DMastalerz, HChen, PGoyal, BZhao, YKim, SHVite, GDLee, FYZhang, HOppenheimer, STokarski, JSWong, TWGavai, AV Novel pyrrolo[2,1-f][1,2,4]triazin-4-amines: Dual inhibitors of EGFR and HER2 protein tyrosine kinases. Bioorg Med Chem Lett 21:781-5 (2011)  
Target
Name:
Epidermal growth factor receptor
Synonyms:
EGF Receptor Substrate EGFR_HUMAN ERBB1 Epidermal Growth Factor Receptor erbB-1 Epidermal growth factor receptor (EGFR) HER1 Proto-oncogene c-ErbB-1 Tyrosine-Protein Kinase ErbB-1
Type:
Receptor Kinase Domain
Mol. Mass.:
134279.59
Organism:
Homo sapiens (Human)
Description:
P00533
Residue:
1210
  
Inhibitor
Name:
BDBM50333374
Synonyms:
5-((4-aminopiperidin-1-yl)methyl)-N-(3-chlorophenyl)pyrrolo[1,2-f][1,2,4]triazin-4-amine | CHEMBL1645473
Type:
Small organic molecule
Emp. Form.:
C18H21ClN6
Mol. Mass.:
356.853
SMILES:
NC1CCN(Cc2ccn3ncnc(Nc4cccc(Cl)c4)c23)CC1
: