Target
Receptor tyrosine-protein kinase erbB-2
Ligand
BDBM50333384
Substrate
Meas. Tech.
ChEMBL_698460 (CHEMBL1647392)
IC50
70±n/a nM
Citation
 Fink, BENorris, DMastalerz, HChen, PGoyal, BZhao, YKim, SHVite, GDLee, FYZhang, HOppenheimer, STokarski, JSWong, TWGavai, AV Novel pyrrolo[2,1-f][1,2,4]triazin-4-amines: Dual inhibitors of EGFR and HER2 protein tyrosine kinases. Bioorg Med Chem Lett 21:781-5 (2011)  
Target
Name:
Receptor tyrosine-protein kinase erbB-2
Synonyms:
2.7.10.1 CD_antigen=CD340 ERBB2_HUMAN FASN/HER2 HER2 MLN19 NEU Proto-oncogene Neu Tyrosine kinase-type cell surface receptor HER2 | p185erbB2
Type:
Mol. Mass.:
137894.47
Organism:
Homo sapiens (Human)
Description:
P04626
Residue:
1255
  
Inhibitor
Name:
BDBM50333384
Synonyms:
5-((4-aminopiperidin-1-yl)methyl)-N-(3-chloro-4-methoxyphenyl)pyrrolo[1,2-f][1,2,4]triazin-4-amine | CHEMBL1645477
Type:
Small organic molecule
Emp. Form.:
C19H23ClN6O
Mol. Mass.:
386.879
SMILES:
COc1ccc(Nc2ncnn3ccc(CN4CCC(N)CC4)c23)cc1Cl
: