Target
Receptor tyrosine-protein kinase erbB-2
Ligand
BDBM50333387
Substrate
Meas. Tech.
ChEMBL_698460 (CHEMBL1647392)
IC50
>1000±n/a nM
Citation
 Fink, BENorris, DMastalerz, HChen, PGoyal, BZhao, YKim, SHVite, GDLee, FYZhang, HOppenheimer, STokarski, JSWong, TWGavai, AV Novel pyrrolo[2,1-f][1,2,4]triazin-4-amines: Dual inhibitors of EGFR and HER2 protein tyrosine kinases. Bioorg Med Chem Lett 21:781-5 (2011)  
Target
Name:
Receptor tyrosine-protein kinase erbB-2
Synonyms:
2.7.10.1 CD_antigen=CD340 ERBB2_HUMAN FASN/HER2 HER2 MLN19 NEU Proto-oncogene Neu Tyrosine kinase-type cell surface receptor HER2 | p185erbB2
Type:
Mol. Mass.:
137894.47
Organism:
Homo sapiens (Human)
Description:
P04626
Residue:
1255
  
Inhibitor
Name:
BDBM50333387
Synonyms:
(S)-N-(1-methyl-1H-indazol-5-yl)-5-((morpholin-2-ylmethoxy)methyl)pyrrolo[1,2-f][1,2,4]triazin-4-amine | CHEMBL1645463
Type:
Small organic molecule
Emp. Form.:
C20H23N7O2
Mol. Mass.:
393.4423
SMILES:
Cn1ncc2cc(Nc3ncnn4ccc(COC[C@@H]5CNCCO5)c34)ccc12
: