Target
Histamine H3 receptor
Ligand
BDBM50333507
Substrate
Meas. Tech.
ChEMBL_699500 (CHEMBL1647755)
Ki
42.6±n/a nM
Citation
 Xiao, DPalani, ASofolarides, MHuang, YAslanian, RVaccaro, HHong, LMcKittrick, BWest, REWilliams, SMWu, RLHwa, JSondey, CLachowicz, J Discovery of a series of potent arylthiadiazole H(3) antagonists. Bioorg Med Chem Lett 21:861-4 (2011)  
Target
Name:
Histamine H3 receptor
Synonyms:
G-protein coupled receptor 97 HH3R HRH3 Histamine H3 receptor (H3) Histamine receptor (H3 and H4)
Type:
G Protein-Coupled Receptor (GPCR)
Mol. Mass.:
48691.47
Organism:
Homo sapiens (Human)
Description:
Binding assays were using CHO cells stably expressing hH3R receptors.
Residue:
445
  
Inhibitor
Name:
BDBM50333507
Synonyms:
3-(5-(1,4'-bipiperidin-1'-yl)-1,3,4-thiadiazol-2-yl)benzonitrile | CHEMBL1641824
Type:
Small organic molecule
Emp. Form.:
C19H23N5S
Mol. Mass.:
353.484
SMILES:
N#Cc1cccc(c1)-c1nnc(s1)N1CCC(CC1)N1CCCCC1
: