Target
Carbonic anhydrase 2
Ligand
BDBM26994
Substrate
Meas. Tech.
ChEMBL_700656 (CHEMBL1645695)
Ki
0.390±n/a nM
Citation
 Bertucci, AInnocenti, AScozzafava, ATambutté, SZoccola, DSupuran, CT Carbonic anhydrase inhibitors. Inhibition studies with anions and sulfonamides of a new cytosolic enzyme from the scleractinian coral Stylophora pistillata. Bioorg Med Chem Lett 21:710-4 (2011)  
Target
Name:
Carbonic anhydrase 2
Synonyms:
CA-II CAC Carbonate dehydratase II Carbonic anhydrase 2 (CA-II) Carbonic anhydrase C Carbonic anhydrase II (CA-II) Carbonic anhydrase II (hCA II) | Carbonic anhydrase isoenzyme II (hCA II)
Type:
Enzyme
Mol. Mass.:
29250.71
Organism:
Homo sapiens (Human)
Description:
P00918
Residue:
260
  
Inhibitor
Name:
BDBM26994
Synonyms:
CHEMBL68253 sulfamic acid
Type:
Emp. Form.:
H3NO3S
Mol. Mass.:
97.094
SMILES:
NS(O)(=O)=O
: