Target
Carbonic anhydrase
Ligand
BDBM26983
Substrate
Meas. Tech.
ChEMBL_700658 (CHEMBL1645697)
Ki
680000±n/a nM
Citation
 Bertucci, AInnocenti, AScozzafava, ATambutté, SZoccola, DSupuran, CT Carbonic anhydrase inhibitors. Inhibition studies with anions and sulfonamides of a new cytosolic enzyme from the scleractinian coral Stylophora pistillata. Bioorg Med Chem Lett 21:710-4 (2011)  
Target
Name:
Carbonic anhydrase
Synonyms:
Alpha carbonic anhydrase
Type:
PROTEIN
Mol. Mass.:
36650.57
Organism:
Stylophora pistillata
Description:
ChEMBL_700658
Residue:
323
  
Inhibitor
Name:
BDBM26983
Synonyms:
CHEMBL1644028 Thiocyanate sodium thiocyanate
Type:
Ion
Emp. Form.:
CNS
Mol. Mass.:
58.083
SMILES:
[N-]=C=S
: