Target
Renin
Ligand
BDBM50333945
Substrate
Meas. Tech.
ChEMBL_700284 (CHEMBL1647502)
Ki
7±n/a nM
Citation
 Sund, CBelda, OWiktelius, DSahlberg, CVrang, LSedig, SHamelink, EHenderson, IAgback, TJansson, KBorkakoti, NDerbyshire, DEneroth, ASamuelsson, B Design and synthesis of potent macrocyclic renin inhibitors. Bioorg Med Chem Lett 21:358-62 (2010)  
Target
Name:
Renin
Synonyms:
Angiotensinogenase RENI_HUMAN
Type:
Enzyme
Mol. Mass.:
45058.99
Organism:
Homo sapiens (Human)
Description:
Residue:
406
  
Inhibitor
Name:
BDBM50333945
Synonyms:
(S)-N-((S)-Benzylcarbamoyl-isopropylsulfanyl-methyl)-2-{(S)-2-hydroxy-2-[(S)-18-(methanesulfonyl-methyl-amino)-2,15-dioxo-4-phenyl-11-oxa-3,14-diaza-tricyclo[14.3.1.1*5,9*]henicosa-1(20),5,7,9(21),16,18-hexaen-13-yl]-ethyl}-3-methyl-butyramide | CHEMBL1644463
Type:
Small organic molecule
Emp. Form.:
C45H55N5O8S2
Mol. Mass.:
858.077
SMILES:
CC(C)S[C@H](NC(=O)[C@@H](C[C@H](O)[C@@H]1COCc2cccc(c2)C(NC(=O)c2cc(cc(c2)C(=O)N1)N(C)S(C)(=O)=O)c1ccccc1)C(C)C)C(=O)NCc1ccccc1
: