Target
Mitogen-activated protein kinase 14
Ligand
BDBM50333982
Substrate
Meas. Tech.
ChEMBL_701209 (CHEMBL1648829)
IC50
>50000±n/a nM
Citation
 Probst, GDBowers, SSealy, JMTruong, APHom, RKGalemmo, RAKonradi, AWSham, HLQuincy, DAPan, HYao, NLin, MTóth, GArtis, DRZmolek, WWong, KQin, ALorentzen, CNakamura, DFQuinn, KPSauer, JMPowell, KRuslim, LWright, SChereau, DRen, ZAnderson, JPBard, FYednock, TAGriswold-Prenner, I Highly selective c-Jun N-terminal kinase (JNK) 2 and 3 inhibitors with in vitro CNS-like pharmacokinetic properties prevent neurodegeneration. Bioorg Med Chem Lett 21:315-9 (2010)  
Target
Name:
Mitogen-activated protein kinase 14
Synonyms:
CSAID-binding protein CSBP1 CSPB1 MAP kinase 14 MAP kinase p38 alpha MAPK14 MK14_HUMAN Mitogen-activated protein kinase p38 alpha Stress-activated protein kinase 2a | p38 MAP kinase alpha/beta
Type:
Serine/threonine-protein kinase
Mol. Mass.:
41286.76
Organism:
Homo sapiens (Human)
Description:
Q16539
Residue:
360
  
Inhibitor
Name:
BDBM50333982
Synonyms:
4-(naphthalen-2-yl)-3-(2-(pyridin-2-ylamino)pyridin-4-yl)-1H-1,2,4-triazol-5(4H)-one | CHEMBL1644625
Type:
Small organic molecule
Emp. Form.:
C22H16N6O
Mol. Mass.:
380.402
SMILES:
O=c1[nH]nc(-c2ccnc(Nc3ccccn3)c2)n1-c1ccc2ccccc2c1
: