Target
Glucocorticoid receptor
Ligand
BDBM19190
Substrate
Meas. Tech.
ChEMBL_701336 (CHEMBL1648956)
IC50
23±n/a nM
Citation
 Roach, SLHiguchi, RIHudson, ARAdams, MESyka, PMMais, DEMiner, JNMarschke, KBZhi, L Tetrahydroquinoline glucocorticoid receptor agonists: discovery of a 3-hydroxyl for improving receptor selectivity. Bioorg Med Chem Lett 21:168-71 (2010)  
Target
Name:
Glucocorticoid receptor
Synonyms:
GCR_HUMAN GRL Glucocorticoid receptor (GRFP) Nuclear receptor subfamily 3 group C member 1
Type:
Enzyme
Mol. Mass.:
85656.87
Organism:
Homo sapiens (Human)
Description:
P04150
Residue:
777
  
Inhibitor
Name:
BDBM19190
Synonyms:
(1S,2R,10S,11S,14R,15S,17S)-14,17-dihydroxy-14-(2-hydroxyacetyl)-2,15-dimethyltetracyclo[8.7.0.0^{2,7}.0^{11,15}]heptadeca-3,6-dien-5-one Delta-Cortef Prednisolone | US10196374, Prednisolone
Type:
Steroid
Emp. Form.:
C21H28O5
Mol. Mass.:
360.444
SMILES:
[H][C@@]12CC[C@](O)(C(=O)CO)[C@@]1(C)C[C@H](O)[C@@]1([H])[C@@]2([H])CCC2=CC(=O)C=C[C@]12C
: