Target
5-hydroxytryptamine receptor 1D
Ligand
BDBM50334732
Substrate
Meas. Tech.
ChEMBL_699283 (CHEMBL1647103)
Ki
410±n/a nM
Citation
 Liu, KGRobichaud, AJGreenfield, AALo, JRGrosanu, CMattes, JFCai, YZhang, GMZhang, JYKowal, DMSmith, DLDi, LKerns, EHSchechter, LEComery, TA Identification of 3-sulfonylindazole derivatives as potent and selective 5-HT(6) antagonists. Bioorg Med Chem 19:650-62 (2011)  
Target
Name:
5-hydroxytryptamine receptor 1D
Synonyms:
5-HT-1D 5-HT1D 5HT1D_HUMAN HTR1DA Serotonin (5-HT) receptor | Serotonin Receptor 1D
Type:
G Protein-Coupled Receptor (GPCR)
Mol. Mass.:
41920.63
Organism:
Homo sapiens (Human)
Description:
Receptor binding assays were performed using human clone stably expressed in CHO cells.
Residue:
377
  
Inhibitor
Name:
BDBM50334732
Synonyms:
3-(3-Chlorophenylsulfonyl)-N-(piperidin-4-yl)-1H-indazol-5-amine HCl | CHEMBL1642882
Type:
Small organic molecule
Emp. Form.:
C18H19ClN4O2S
Mol. Mass.:
390.887
SMILES:
Clc1cccc(c1)S(=O)(=O)c1n[nH]c2ccc(NC3CCNCC3)cc12
: