Target
Serine/threonine-protein kinase Chk1
Ligand
BDBM50334902
Substrate
Meas. Tech.
ChEMBL_699554 (CHEMBL1647912)
IC50
860±n/a nM
Citation
 Dwyer, MPParuch, KLabroli, MAlvarez, CKeertikar, KMPoker, CRossman, RFischmann, TODuca, JSMadison, VParry, DDavis, NSeghezzi, WWiswell, DGuzi, TJ Discovery of pyrazolo[1,5-a]pyrimidine-based CHK1 inhibitors: a template-based approach--part 1. Bioorg Med Chem Lett 21:467-70 (2010)  
Target
Name:
Serine/threonine-protein kinase Chk1
Synonyms:
CHEK1 CHK1 checkpoint homolog Checkpoint kinase-1 (CHK1)
Type:
Enzyme Catalytic Domain
Mol. Mass.:
54443.02
Organism:
Homo sapiens (Human)
Description:
gi_166295192
Residue:
476
  
Inhibitor
Name:
BDBM50334902
Synonyms:
2-(3-(1-methyl-1H-pyrazol-4-yl)-5-(piperidin-3-yl)pyrazolo[1,5-a]pyrimidin-7-ylamino)ethanol | CHEMBL1643259
Type:
Small organic molecule
Emp. Form.:
C17H23N7O
Mol. Mass.:
341.4108
SMILES:
Cn1cc(cn1)-c1cnn2c(NCCO)cc(nc12)C1CCCNC1
: