Target
Serine/threonine-protein kinase Chk1
Ligand
BDBM50334913
Substrate
Meas. Tech.
ChEMBL_699554 (CHEMBL1647912)
IC50
2900±n/a nM
Citation
 Dwyer, MPParuch, KLabroli, MAlvarez, CKeertikar, KMPoker, CRossman, RFischmann, TODuca, JSMadison, VParry, DDavis, NSeghezzi, WWiswell, DGuzi, TJ Discovery of pyrazolo[1,5-a]pyrimidine-based CHK1 inhibitors: a template-based approach--part 1. Bioorg Med Chem Lett 21:467-70 (2010)  
Target
Name:
Serine/threonine-protein kinase Chk1
Synonyms:
CHEK1 CHK1 checkpoint homolog Checkpoint kinase-1 (CHK1)
Type:
Enzyme Catalytic Domain
Mol. Mass.:
54443.02
Organism:
Homo sapiens (Human)
Description:
gi_166295192
Residue:
476
  
Inhibitor
Name:
BDBM50334913
Synonyms:
3-bromo-5-phenylpyrazolo[1,5-a]pyrimidin-7-amine | CHEMBL249337
Type:
Small organic molecule
Emp. Form.:
C12H9BrN4
Mol. Mass.:
289.131
SMILES:
Nc1cc(nc2c(Br)cnn12)-c1ccccc1
: