Target
Cyclin-A1/Cyclin-A2/Cyclin-dependent kinase 2
Ligand
BDBM50334893
Substrate
Meas. Tech.
ChEMBL_699555 (CHEMBL1647913)
IC50
2200±n/a nM
Citation
 Dwyer, MPParuch, KLabroli, MAlvarez, CKeertikar, KMPoker, CRossman, RFischmann, TODuca, JSMadison, VParry, DDavis, NSeghezzi, WWiswell, DGuzi, TJ Discovery of pyrazolo[1,5-a]pyrimidine-based CHK1 inhibitors: a template-based approach--part 1. Bioorg Med Chem Lett 21:467-70 (2010)  
Target
Name:
Cyclin-A1/Cyclin-A2/Cyclin-dependent kinase 2
Synonyms:
CDK2/Cyclin A/Cyclin A1 Cyclin-dependent kinase 2/cyclin A
Type:
Mol. Mass.:
Description:
ASSAY_ID of EBI is 42813
Components:
This complex has 3 components.
Component 1
Name:
Cyclin-A2
Synonyms:
CCN1 CCNA1 CCNA2_HUMAN Cyclin-A
Type:
Enzyme Subunit
Mol. Mass.:
48550.19
Organism:
Homo sapiens (Human)
Description:
P20248
Residue:
432
  
Component 2
Name:
Cyclin-A1
Synonyms:
CCNA1 CDK2/Cyclin A1 Cyclin-A1/Cyclin-dependent kinase 4
Type:
Enzyme
Mol. Mass.:
52343.37
Organism:
Homo sapiens (Human)
Description:
P78396
Residue:
465
  
Component 3
Name:
Cyclin-dependent kinase 2
Synonyms:
CDK2 CDK2_HUMAN Cell division protein kinase 2 Protein cereblon/Cyclin-dependent kinase 2 | p33 protein kinase
Type:
Enzyme Subunit
Mol. Mass.:
33938.17
Organism:
Homo sapiens (Human)
Description:
P24941
Residue:
298
  
Component 4
Name:
Cyclin-A2
Synonyms:
CCN1 CCNA1 CCNA2_HUMAN Cyclin-A
Type:
Enzyme Subunit
Mol. Mass.:
48550.19
Organism:
Homo sapiens (Human)
Description:
P20248
Residue:
432
  
Inhibitor
Name:
BDBM50334893
Synonyms:
5-(piperidin-3-yl)-3-(1H-pyrazol-5-yl)pyrazolo[1,5-a]pyrimidin-7-amine | CHEMBL1643250
Type:
Small organic molecule
Emp. Form.:
C14H17N7
Mol. Mass.:
283.3317
SMILES:
Nc1cc(nc2c(cnn12)-c1cc[nH]n1)C1CCCNC1
: