Target
Serine/threonine-protein kinase Chk1
Ligand
BDBM50334886
Substrate
Meas. Tech.
ChEMBL_699554 (CHEMBL1647912)
IC50
1700±n/a nM
Citation
 Dwyer, MPParuch, KLabroli, MAlvarez, CKeertikar, KMPoker, CRossman, RFischmann, TODuca, JSMadison, VParry, DDavis, NSeghezzi, WWiswell, DGuzi, TJ Discovery of pyrazolo[1,5-a]pyrimidine-based CHK1 inhibitors: a template-based approach--part 1. Bioorg Med Chem Lett 21:467-70 (2010)  
Target
Name:
Serine/threonine-protein kinase Chk1
Synonyms:
CHEK1 CHK1 checkpoint homolog Checkpoint kinase-1 (CHK1)
Type:
Enzyme Catalytic Domain
Mol. Mass.:
54443.02
Organism:
Homo sapiens (Human)
Description:
gi_166295192
Residue:
476
  
Inhibitor
Name:
BDBM50334886
Synonyms:
3-(7-amino-5-(piperidin-3-yl)pyrazolo[1,5-a]pyrimidin-3-yl)phenol | CHEMBL1643244
Type:
Small organic molecule
Emp. Form.:
C17H19N5O
Mol. Mass.:
309.3657
SMILES:
Nc1cc(nc2c(cnn12)-c1cccc(O)c1)C1CCCNC1
: