Target
DNA polymerase subunit gamma-1
Ligand
BDBM50335556
Substrate
Meas. Tech.
ChEMBL_708958 (CHEMBL1665165)
IC50
>150000±n/a nM
Citation
 Wolfgang, GHShibata, RWang, JRay, ASWu, SDoerrfler, EReiser, HLee, WABirkus, GChristensen, NDAndrei, GSnoeck, R GS-9191 is a novel topical prodrug of the nucleotide analog 9-(2-phosphonylmethoxyethyl)guanine with antiproliferative activity and possible utility in the treatment of human papillomavirus lesions. Antimicrob Agents Chemother 53:2777-84 (2009)  
Target
Name:
DNA polymerase subunit gamma-1
Synonyms:
DNA Polymerase gamma DNA polymerase (alpha/delta/epsilon) DNA polymerase delta subunit 1 DNA polymerase gamma subunit 1 DNA polymerase kappa DNA polymerase subunit gamma-1 DPOG1_HUMAN Mitochondrial DNA polymerase catalytic subunit POLG1 PolG-alpha
Type:
Enzyme Subunit
Mol. Mass.:
139566.98
Organism:
Homo sapiens (Human)
Description:
Enzyme was purchased from Ulrich Hubscher, University of Zurich-Irchel, Switzerland.
Residue:
1239
  
Inhibitor
Name:
BDBM50335556
Synonyms:
CHEMBL1652469 | [({[({2-[2-amino-6-(cyclopropylamino)-9H-purin-9-yl]ethoxy}methyl)(hydroxy)phosphoryl]oxy}(hydroxy)phosphoryl)oxy]phosphonic acid
Type:
Small organic molecule
Emp. Form.:
C11H19N6O10P3
Mol. Mass.:
488.224
SMILES:
Nc1nc(NC2CC2)c2ncn(CCOCP(O)(=O)OP(O)(=O)OP(O)(O)=O)c2n1
: