Target
Cholinesterase
Ligand
BDBM50335595
Substrate
Meas. Tech.
ChEMBL_714912 (CHEMBL1663858)
IC50
339000±n/a nM
Citation
 Youkwan, JSutthivaiyakit, SSutthivaiyakit, P Citrusosides A-D and furanocoumarins with cholinesterase inhibitory activity from the fruit peels of Citrus hystrix. J Nat Prod 73:1879-83 (2010)  
Target
Name:
Cholinesterase
Synonyms:
BCHE CHLE_HORSE | Cholinesterase
Type:
Enzyme
Mol. Mass.:
65643.35
Organism:
Equus caballus (Horse)
Description:
P81908
Residue:
574
  
Inhibitor
Name:
BDBM50335595
Synonyms:
CHEMBL1651085 | citrusoside B
Type:
Small organic molecule
Emp. Form.:
C36H48O15
Mol. Mass.:
720.7573
SMILES:
CC(C)O[C@@H]1O[C@H](COC(=O)CC(C)(O)CC(=O)O[C@H](CC\C(C)=C\COc2c3ccoc3cc3oc(=O)ccc23)C(C)(C)O)[C@@H](O)[C@H](O)[C@H]1O
: