Target
Cholinesterase
Ligand
BDBM50335597
Substrate
Meas. Tech.
ChEMBL_714912 (CHEMBL1663858)
IC50
11200±n/a nM
Citation
 Youkwan, JSutthivaiyakit, SSutthivaiyakit, P Citrusosides A-D and furanocoumarins with cholinesterase inhibitory activity from the fruit peels of Citrus hystrix. J Nat Prod 73:1879-83 (2010)  
Target
Name:
Cholinesterase
Synonyms:
BCHE CHLE_HORSE | Cholinesterase
Type:
Enzyme
Mol. Mass.:
65643.35
Organism:
Equus caballus (Horse)
Description:
P81908
Residue:
574
  
Inhibitor
Name:
BDBM50335597
Synonyms:
6'-hydroxy-7'-methoxybergamottin | CHEMBL1651089
Type:
Small organic molecule
Emp. Form.:
C22H26O6
Mol. Mass.:
386.4382
SMILES:
COC(C)(C)[C@H](O)CC\C(C)=C\COc1c2ccoc2cc2oc(=O)ccc12
: