Target
Cytochrome P450 3A4
Ligand
BDBM31768
Substrate
Meas. Tech.
ChEMBL_715320 (CHEMBL1664607)
IC50
50±n/a nM
Citation
 Marchais-Oberwinkler, SWetzel, MZiegler, EKruchten, PWerth, RHenn, CHartmann, RWFrotscher, M New drug-like hydroxyphenylnaphthol steroidomimetics as potent and selective 17ß-hydroxysteroid dehydrogenase type 1 inhibitors for the treatment of estrogen-dependent diseases. J Med Chem 54:534-47 (2011)  
Target
Name:
Cytochrome P450 3A4
Synonyms:
Albendazole monooxygenase CP3A4_HUMAN CYP3A4 CYPIIIA4 Cytochrome P450 3A4 (CYP3A4) Nifedipine oxidase Taurochenodeoxycholate 6-alpha-hydroxylase
Type:
Enzyme
Mol. Mass.:
57349.57
Organism:
Homo sapiens (Human)
Description:
Residue:
503
  
Inhibitor
Name:
BDBM31768
Synonyms:
CHEMBL295698 Nizoral | Panfungol
Type:
Small organic molecule
Emp. Form.:
C26H28Cl2N4O4
Mol. Mass.:
531.431
SMILES:
CC(=O)N1CCN(CC1)c1ccc(OC[C@@H]2CO[C@](Cn3ccnc3)(O2)c2ccc(Cl)cc2Cl)cc1
: