Target
Cannabinoid receptor 1
Ligand
BDBM21307
Substrate
Meas. Tech.
ChEMBL_717852 (CHEMBL1670560)
Ki
780±n/a nM
Citation
 Brogi, SCorelli, FDi Marzo, VLigresti, AMugnaini, CPasquini, STafi, A Three-dimensional quantitative structure-selectivity relationships analysis guided rational design of a highly selective ligand for the cannabinoid receptor 2. Eur J Med Chem 46:547-55 (2011)  
Target
Name:
Cannabinoid receptor 1
Synonyms:
CANN6 CB-R CNR CNR1_HUMAN Cannabinoid receptor Cannabinoid receptor 1 (brain)
Type:
G Protein-Coupled Receptor (GPCR)
Mol. Mass.:
52868.96
Organism:
Homo sapiens (Human)
Description:
P21554
Residue:
472
  
Inhibitor
Name:
BDBM21307
Synonyms:
6-methoxy-1-(oxan-4-ylmethyl)-3-[(2,2,3,3-tetramethylcyclopropyl)carbonyl]-1H-indol-5-ol | Tetrahydropyranyl-methyl analogue, 28
Type:
Small organic molecule
Emp. Form.:
C23H31NO4
Mol. Mass.:
385.4965
SMILES:
COc1cc2n(CC3CCOCC3)cc(C(=O)C3C(C)(C)C3(C)C)c2cc1O
: