Target
Potassium voltage-gated channel subfamily H member 2
Ligand
BDBM50336386
Substrate
Meas. Tech.
ChEMBL_716794 (CHEMBL1670716)
IC50
>20000±n/a nM
Citation
 Richter, HGBenson, GMBleicher, KHBlum, DChaput, EClemann, NFeng, SGardes, CGrether, UHartman, PKuhn, BMartin, REPlancher, JMRudolph, MGSchuler, FTaylor, S Optimization of a novel class of benzimidazole-based farnesoid X receptor (FXR) agonists to improve physicochemical and ADME properties. Bioorg Med Chem Lett 21:1134-40 (2011)  
Target
Name:
Potassium voltage-gated channel subfamily H member 2
Synonyms:
1,3-beta-glucan synthase component GLS2 ERG Eag-related protein 1 Ether-a-go-go-related gene (HERG) Ether-a-go-go-related gene potassium channel 1 Ether-a-go-go-related gene potassium channel 1 (hERG1) Ether-a-go-go-related protein 1 H-ERG KCNH2 Potassium voltage-gated channel subfamily H member 2 (hERG) Voltage-gated potassium channel subunit Kv11.1 hERG Potassium Channel 1 | putative potassium channel subunit
Type:
Multi-pass membrane protein
Mol. Mass.:
126672.65
Organism:
Homo sapiens (Human)
Description:
Q12809
Residue:
1159
  
Inhibitor
Name:
BDBM50336386
Synonyms:
(S)-4-(2-(2-(4-chlorophenyl)-5,6-difluoro-1H-benzo[d]imidazol-1-yl)-2-cyclohexylacetamido)benzoic acid CHEMBL1615153 | FXR_53
Type:
Small organic molecule
Emp. Form.:
C28H24ClF2N3O3
Mol. Mass.:
523.958
SMILES:
OC(=O)c1ccc(NC(=O)[C@H](C2CCCCC2)n2c(nc3cc(F)c(F)cc23)-c2ccc(Cl)cc2)cc1
: