Target
Bile acid receptor
Ligand
BDBM21724
Substrate
Meas. Tech.
ChEMBL_716785 (CHEMBL1670707)
EC50
910±n/a nM
Citation
 Richter, HGBenson, GMBleicher, KHBlum, DChaput, EClemann, NFeng, SGardes, CGrether, UHartman, PKuhn, BMartin, REPlancher, JMRudolph, MGSchuler, FTaylor, S Optimization of a novel class of benzimidazole-based farnesoid X receptor (FXR) agonists to improve physicochemical and ADME properties. Bioorg Med Chem Lett 21:1134-40 (2011)  
Target
Name:
Bile acid receptor
Synonyms:
BAR FXR HRR1 NR1H4_HUMAN RIP14 Retinoid X receptor-interacting protein 14 | farnesoid x receptor
Type:
Nuclear Receptor
Mol. Mass.:
55916.24
Organism:
Homo sapiens (Human)
Description:
Q96RI1
Residue:
486
  
Inhibitor
Name:
BDBM21724
Synonyms:
3-[(E)-2-(2-chloro-4-{[3-(2,6-dichlorophenyl)-5-(1-methylethyl)isoxazol-4-yl]methoxy}phenyl)ethenyl]benzoic acid CHEMBL318457 | GW-4064
Type:
Small organic molecule
Emp. Form.:
C28H22Cl3NO4
Mol. Mass.:
542.838
SMILES:
CC(C)c1onc(c1COc1ccc(\C=C\c2cccc(c2)C(O)=O)c(Cl)c1)-c1c(Cl)cccc1Cl
: