Target
Cytochrome P450 2D6
Ligand
BDBM50336383
Substrate
Meas. Tech.
ChEMBL_716790 (CHEMBL1670712)
IC50
>50000±n/a nM
Citation
 Richter, HGBenson, GMBleicher, KHBlum, DChaput, EClemann, NFeng, SGardes, CGrether, UHartman, PKuhn, BMartin, REPlancher, JMRudolph, MGSchuler, FTaylor, S Optimization of a novel class of benzimidazole-based farnesoid X receptor (FXR) agonists to improve physicochemical and ADME properties. Bioorg Med Chem Lett 21:1134-40 (2011)  
Target
Name:
Cytochrome P450 2D6
Synonyms:
CP2D6_HUMAN CYP2DL1 Cytochrome P450 2D6 (CYP2D6) P450-DB1
Type:
Protein
Mol. Mass.:
55774.82
Organism:
Homo sapiens (Human)
Description:
P10635
Residue:
497
  
Inhibitor
Name:
BDBM50336383
Synonyms:
(S)-4-(2-(2-(4-chlorophenyl)-5,6-difluoro-1H-benzo[d]imidazol-1-yl)-2-cyclohexylacetamido)-3-methylbenzoic acid CHEMBL1615150
Type:
Small organic molecule
Emp. Form.:
C29H26ClF2N3O3
Mol. Mass.:
537.985
SMILES:
Cc1cc(ccc1NC(=O)[C@H](C1CCCCC1)n1c(nc2cc(F)c(F)cc12)-c1ccc(Cl)cc1)C(O)=O
: