Target
Delta-type opioid receptor
Ligand
BDBM50336594
Substrate
Meas. Tech.
ChEMBL_725618 (CHEMBL1677801)
Ki
1.3±n/a nM
Citation
 Spetea, MWindisch, PGuo, YBileviciute-Ljungar, ISchütz, JAsim, MFBerzetei-Gurske, IPRiba, PKiraly, KFürst, SAl-Khrasani, MSchmidhammer, H Synthesis and pharmacological activities of 6-glycine substituted 14-phenylpropoxymorphinans, a novel class of opioids with high opioid receptor affinities and antinociceptive potencies. J Med Chem 54:980-8 (2011)  
Target
Name:
Delta-type opioid receptor
Synonyms:
Cytochrome P450 3A4 Delta opioid receptor Delta-type opioid receptor (DOR) OPRD_RAT Opioid receptor Opioid receptors; mu & delta Ror-a | Voltage-gated potassium channel
Type:
G Protein-Coupled Receptor (GPCR)
Mol. Mass.:
40465.04
Organism:
Rattus norvegicus (rat)
Description:
Competition binding assays were using CHO-K1 cell membranes expressing the opioid receptor.
Residue:
372
  
Inhibitor
Name:
BDBM50336594
Synonyms:
CHEMBL1672086 | tert-butyl 2-{[(1S,5R,13R,14S,17S)-10-hydroxy-4-methyl-17-(3-phenylpropoxy)-12-oxa-4-azapentacyclo[9.6.1.0^{1,13}.0^{5,17}.0^{7,18}]octadeca-7(18),8,10-trien-14-yl]amino}acetate
Type:
Small organic molecule
Emp. Form.:
C32H42N2O5
Mol. Mass.:
534.6863
SMILES:
CN1CC[C@@]23[C@H]4Oc5c2c(C[C@@H]1[C@@]3(CC[C@@H]4NCC(=O)OC(C)(C)C)OCCCc1ccccc1)ccc5O
: