Target
Bombesin receptor subtype-3
Ligand
BDBM50336889
Substrate
Meas. Tech.
ChEMBL_718879 (CHEMBL1681373)
EC50
2.2±n/a nM
Citation
 Sebhat, IKFranklin, CLo, MMChen, DJewell, JPMiller, RPang, JPalyha, OKan, YKelly, TMGuan, XMMarsh, DJKosinski, JAMetzger, JMLyons, KDragovic, JGuzzo, PRHenderson, AJReitman, MLNargund, RPWyvratt, MJ Discovery of MK-5046, a Potent, Selective Bombesin Receptor Subtype-3 Agonist for the Treatment of Obesity ACS Med Chem Lett 2:43-47 (2011)  
Target
Name:
Bombesin receptor subtype-3
Synonyms:
BRS3_RAT Brs3
Type:
Enzyme Catalytic Domain
Mol. Mass.:
44213.49
Organism:
RAT
Description:
Bombesin 0 RAT::Q8K418
Residue:
399
  
Inhibitor
Name:
BDBM50336889
Synonyms:
(2S)-1,1,1-trifluoro-2-[4-(1H-pyrazol-1-yl)phenyl]-3-(4-{[1-(trifluoromethyl)cyclopropyl]methyl}-1H-imidazol-2-yl)propan-2-ol | CHEMBL1672354
Type:
Small organic molecule
Emp. Form.:
C20H18F6N4O
Mol. Mass.:
444.3735
SMILES:
O[C@@](Cc1ncc(CC2(CC2)C(F)(F)F)[nH]1)(c1ccc(cc1)-n1cccn1)C(F)(F)F
: